Target
Lysophosphatidic acid receptor 1
Ligand
BDBM50146230
Substrate
Meas. Tech.
ChEMBL_100171 (CHEMBL707056)
Ki
156±n/a nM
Citation
 Heasley, BHJarosz, RLynch, KRMacdonald, TL Initial structure-activity relationships of lysophosphatidic acid receptor antagonists: discovery of a high-affinity LPA1/LPA3 receptor antagonist. Bioorg Med Chem Lett 14:2735-40 (2004)  
Target
Name:
Lysophosphatidic acid receptor 1
Synonyms:
EDG2 LPA-1 LPAR1 Lysophosphatidic acid receptor 1 (LPA1) | Lysophosphatidic acid receptor Edg-2
Type:
Enzyme
Mol. Mass.:
41120.55
Organism:
Homo sapiens (Human)
Description:
Q92633
Residue:
364
  
Inhibitor
Name:
BDBM50146230
Synonyms:
CHEMBL314555 Phosphoric acid mono-{2-((Z)-(S)-octadec-9-enoylamino)-3-[4-(pyridin-2-ylmethoxy)-phenyl]-propyl} ester
Type:
Small organic molecule
Emp. Form.:
C33H51N2O6P
Mol. Mass.:
602.7416
SMILES:
CCCCCCCC\C=C/CCCCCCCC(=O)N[C@H](COP(O)(O)=O)Cc1ccc(OCc2ccccn2)cc1
: