Target
Lysophosphatidic acid receptor 1
Ligand
BDBM50146240
Substrate
Meas. Tech.
ChEMBL_100171 (CHEMBL707056)
Ki
34±n/a nM
Citation
 Heasley, BHJarosz, RLynch, KRMacdonald, TL Initial structure-activity relationships of lysophosphatidic acid receptor antagonists: discovery of a high-affinity LPA1/LPA3 receptor antagonist. Bioorg Med Chem Lett 14:2735-40 (2004)  
Target
Name:
Lysophosphatidic acid receptor 1
Synonyms:
EDG2 LPA-1 LPAR1 Lysophosphatidic acid receptor 1 (LPA1) | Lysophosphatidic acid receptor Edg-2
Type:
Enzyme
Mol. Mass.:
41120.55
Organism:
Homo sapiens (Human)
Description:
Q92633
Residue:
364
  
Inhibitor
Name:
BDBM50146240
Synonyms:
CHEMBL91058 | Phosphoric acid mono-[(R)-3-[4-(3-methoxy-benzyloxy)-phenyl]-2-((Z)-octadec-9-enoylamino)-propyl] ester
Type:
Small organic molecule
Emp. Form.:
C35H54NO7P
Mol. Mass.:
631.7795
SMILES:
CCCCCCCC\C=C/CCCCCCCC(=O)N[C@@H](COP(O)(O)=O)Cc1ccc(OCc2cccc(OC)c2)cc1
: