Target
Cholinesterase
Ligand
BDBM50579323
Substrate
Meas. Tech.
ChEMBL_2134901 (CHEMBL4844511)
IC50
528±n/a nM
Citation
 Wichur, TPasieka, AGody?, JPanek, DGóral, ILatacz, GHonkisz-Orzechowska, EBucki, ASiwek, AG?uch-Lutwin, MKnez, DBrazzolotto, XGobec, SKo?aczkowski, MSabate, RMalawska, BWi?ckowska, A Discovery of 1-(phenylsulfonyl)-1H-indole-based multifunctional ligands targeting cholinesterases and 5-HT Eur J Med Chem 225:0 (2021)  
Target
Name:
Cholinesterase
Synonyms:
BCHE CHLE_HORSE | Cholinesterase
Type:
Enzyme
Mol. Mass.:
65643.35
Organism:
Equus caballus (Horse)
Description:
P81908
Residue:
574
  
Inhibitor
Name:
BDBM50579323
Synonyms:
CHEMBL4878361
Type:
Small organic molecule
Emp. Form.:
C25H27N3O3S
Mol. Mass.:
449.565
SMILES:
O=S(=O)(c1ccccc1)n1ccc2c(OCCNCCNCc3ccccc3)cccc12
: