Target
Cholinesterase
Ligand
BDBM11682
Substrate
Meas. Tech.
ChEMBL_2134901 (CHEMBL4844511)
IC50
2195±n/a nM
Citation
 Wichur, TPasieka, AGody?, JPanek, DGóral, ILatacz, GHonkisz-Orzechowska, EBucki, ASiwek, AG?uch-Lutwin, MKnez, DBrazzolotto, XGobec, SKo?aczkowski, MSabate, RMalawska, BWi?ckowska, A Discovery of 1-(phenylsulfonyl)-1H-indole-based multifunctional ligands targeting cholinesterases and 5-HT Eur J Med Chem 225:0 (2021)  
Target
Name:
Cholinesterase
Synonyms:
BCHE CHLE_HORSE | Cholinesterase
Type:
Enzyme
Mol. Mass.:
65643.35
Organism:
Equus caballus (Horse)
Description:
P81908
Residue:
574
  
Inhibitor
Name:
BDBM11682
Synonyms:
2,3-dihydroxybutanedioic acid; 3-[(1S)-1-(dimethylamino)ethyl]phenyl N-ethyl-N-methylcarbamate US9586925, Rivastigmine
Type:
Small organic molecule
Emp. Form.:
C14H22N2O2
Mol. Mass.:
250.3367
SMILES:
CCN(C)C(=O)Oc1cccc(c1)[C@H](C)N(C)C
: