Target
Arginase-1
Ligand
BDBM50579615
Substrate
Meas. Tech.
ChEMBL_2135941 (CHEMBL4845551)
IC50
5.0±n/a nM
Citation
 Li, DZhang, HLyons, TWLu, MAchab, APu, QChilders, MMitcheltree, MJWang, JMartinot, TAMcMinn, SESloman, DLPalani, ABeard, ANogle, LGathiaka, SSaurí, JKim, HYAdpressa, DSpacciapoli, PMiller, JRPalte, RLLesburg, CACumming, JFischer, C Comprehensive Strategies to Bicyclic Prolines: Applications in the Synthesis of Potent Arginase Inhibitors. ACS Med Chem Lett 12:1678-1688 (2021)  
Target
Name:
Arginase-1
Synonyms:
ARG1 Liver-type arginase | Type I arginase
Type:
PROTEIN
Mol. Mass.:
34737.53
Organism:
Homo sapiens (Human)
Description:
ChEMBL_978893
Residue:
322
  
Inhibitor
Name:
BDBM50579615
Synonyms:
CHEMBL4865209
Type:
Small organic molecule
Emp. Form.:
C10H18BNO5
Mol. Mass.:
243.065
SMILES:
[H][C@]12CN[C@H](C(O)=O)[C@@]1(CCCB(O)O)COC2
: