Target
Plasminogen
Ligand
BDBM50138663
Substrate
Meas. Tech.
ChEBML_155598
Ki
51000±n/a nM
Citation
 Wendt, MDGeyer, AMcClellan, WJRockway, TWWeitzberg, MZhao, XMantei, RStewart, KNienaber, VKlinghofer, VGiranda, VL Interaction with the S1 beta-pocket of urokinase: 8-heterocycle substituted and 6,8-disubstituted 2-naphthamidine urokinase inhibitors. Bioorg Med Chem Lett 14:3063-8 (2004)  
Target
Name:
Plasminogen
Synonyms:
Activation peptide PLG Plasmin Plasmin heavy chain A, short form | Plasmin light chain B
Type:
Enzyme
Mol. Mass.:
90579.18
Organism:
Homo sapiens (Human)
Description:
Residue:
810
  
Inhibitor
Name:
BDBM50138663
Synonyms:
2-naphthimidamide Naphthalene-2-carboxamidine uPa_6
Type:
Small organic molecule
Emp. Form.:
C11H10N2
Mol. Mass.:
170.2105
SMILES:
NC(=N)c1ccc2ccccc2c1
: