Target
Serine/threonine-protein kinase B-raf
Ligand
BDBM50580082
Substrate
Meas. Tech.
ChEMBL_2146551 (CHEMBL5030897)
Ki
<0.080000±n/a nM
Citation
 Huestis, MPDela Cruz, DDiPasquale, AGDurk, MREigenbrot, CGibbons, PGobbi, AHunsaker, TLLa, HLeung, DHLiu, WMalek, SMerchant, MMoffat, JGMuli, CSOrr, CJParr, BTShanahan, FSneeringer, CJWang, WYen, IYin, JSiu, MRudolph, J Targeting KRAS Mutant Cancers via Combination Treatment: Discovery of a 5-Fluoro-4-(3 J Med Chem 64:3940-3955 (2021)  
Target
Name:
Serine/threonine-protein kinase B-raf
Synonyms:
B-RAF B-Raf proto-oncogene serine/threonine-protein kinase BRAF1 RAFB1 v-Raf murine sarcoma viral oncogene homolog B1
Type:
Serine/threonine-protein kinase
Mol. Mass.:
84446.00
Organism:
Homo sapiens (Human)
Description:
P15056
Residue:
766
  
Inhibitor
Name:
BDBM50580082
Synonyms:
CHEMBL5079215
Type:
Small organic molecule
Emp. Form.:
C20H28FN7O2
Mol. Mass.:
417.4804
SMILES:
CN(C(=O)Nc1cc(NC(=O)NCCC(C)(C)C)c(F)cc1C)c1cc(N)ncn1
: