Target
Adenosine receptor A1
Ligand
BDBM50580162
Substrate
Meas. Tech.
ChEMBL_2147327 (CHEMBL5031673)
Ki
2450±n/a nM
Citation
 Lee, YHou, XLee, JHNayak, AAlexander, VSharma, PKChang, HPhan, KGao, ZGJacobson, KAChoi, SJeong, LS Subtle Chemical Changes Cross the Boundary between Agonist and Antagonist: New A J Med Chem 64:12525-12536 (2021)  
Target
Name:
Adenosine receptor A1
Synonyms:
A1 adenosine receptor (hA1) AA1R_HUMAN ADORA1 Adenosine A1-receptor Adenosine receptor A1 (hA1) | Adenosine transporter (AdT)
Type:
G Protein-Coupled Receptor (GPCR)
Mol. Mass.:
36520.92
Organism:
Homo sapiens (Human)
Description:
P30542
Residue:
326
  
Inhibitor
Name:
BDBM50580162
Synonyms:
CHEMBL5086261
Type:
Small organic molecule
Emp. Form.:
C16H17IN6OS
Mol. Mass.:
468.315
SMILES:
N[C@@H]1CS[C@H]([C@@H]1O)n1cnc2c(NCc3cccc(I)c3)ncnc12
: