Target
Adenosine receptor A1
Ligand
BDBM50580163
Substrate
Meas. Tech.
ChEMBL_2147327 (CHEMBL5031673)
Ki
1670±n/a nM
Citation
 Lee, YHou, XLee, JHNayak, AAlexander, VSharma, PKChang, HPhan, KGao, ZGJacobson, KAChoi, SJeong, LS Subtle Chemical Changes Cross the Boundary between Agonist and Antagonist: New A J Med Chem 64:12525-12536 (2021)  
Target
Name:
Adenosine receptor A1
Synonyms:
A1 adenosine receptor (hA1) AA1R_HUMAN ADORA1 Adenosine A1-receptor Adenosine receptor A1 (hA1) | Adenosine transporter (AdT)
Type:
G Protein-Coupled Receptor (GPCR)
Mol. Mass.:
36520.92
Organism:
Homo sapiens (Human)
Description:
P30542
Residue:
326
  
Inhibitor
Name:
BDBM50580163
Synonyms:
CHEMBL5075606
Type:
Small organic molecule
Emp. Form.:
C10H14N6OS
Mol. Mass.:
266.323
SMILES:
CNc1ncnc2n(cnc12)[C@@H]1SC[C@@H](N)[C@H]1O
: