Target
Adenosine receptor A2a
Ligand
BDBM50580162
Substrate
Meas. Tech.
ChEMBL_2147328 (CHEMBL5031674)
Ki
2300±n/a nM
Citation
 Lee, YHou, XLee, JHNayak, AAlexander, VSharma, PKChang, HPhan, KGao, ZGJacobson, KAChoi, SJeong, LS Subtle Chemical Changes Cross the Boundary between Agonist and Antagonist: New A J Med Chem 64:12525-12536 (2021)  
Target
Name:
Adenosine receptor A2a
Synonyms:
A2A adenosine receptor (hA2A) ADENOSINE A2 ADORA2 Adenosine A2A receptor (A2AAR)
Type:
G Protein-Coupled Receptor (GPCR)
Mol. Mass.:
44716.46
Organism:
Homo sapiens (Human)
Description:
P29274
Residue:
412
  
Inhibitor
Name:
BDBM50580162
Synonyms:
CHEMBL5086261
Type:
Small organic molecule
Emp. Form.:
C16H17IN6OS
Mol. Mass.:
468.315
SMILES:
N[C@@H]1CS[C@H]([C@@H]1O)n1cnc2c(NCc3cccc(I)c3)ncnc12
: