Target
Adenosine receptor A3
Ligand
BDBM50580161
Substrate
Meas. Tech.
ChEMBL_2147329 (CHEMBL5031675)
Ki
380±n/a nM
Citation
 Lee, YHou, XLee, JHNayak, AAlexander, VSharma, PKChang, HPhan, KGao, ZGJacobson, KAChoi, SJeong, LS Subtle Chemical Changes Cross the Boundary between Agonist and Antagonist: New A J Med Chem 64:12525-12536 (2021)  
Target
Name:
Adenosine receptor A3
Synonyms:
A3 adenosine receptor (hA3) ADORA3 | Adenosine A3 receptor (A3AR)
Type:
G Protein-Coupled Receptor (GPCR)
Mol. Mass.:
36197.32
Organism:
Homo sapiens (Human)
Description:
P0DMS8
Residue:
318
  
Inhibitor
Name:
BDBM50580161
Synonyms:
CHEMBL5081923
Type:
Small organic molecule
Emp. Form.:
C16H16ClIN6OS
Mol. Mass.:
502.76
SMILES:
N[C@@H]1CS[C@H]([C@@H]1O)n1cnc2c(NCc3cccc(I)c3)nc(Cl)nc12
: