Target
Adenosine receptor A3
Ligand
BDBM50580163
Substrate
Meas. Tech.
ChEMBL_2147329 (CHEMBL5031675)
Ki
2.4±n/a nM
Citation
 Lee, YHou, XLee, JHNayak, AAlexander, VSharma, PKChang, HPhan, KGao, ZGJacobson, KAChoi, SJeong, LS Subtle Chemical Changes Cross the Boundary between Agonist and Antagonist: New A J Med Chem 64:12525-12536 (2021)  
Target
Name:
Adenosine receptor A3
Synonyms:
A3 adenosine receptor (hA3) ADORA3 | Adenosine A3 receptor (A3AR)
Type:
G Protein-Coupled Receptor (GPCR)
Mol. Mass.:
36197.32
Organism:
Homo sapiens (Human)
Description:
P0DMS8
Residue:
318
  
Inhibitor
Name:
BDBM50580163
Synonyms:
CHEMBL5075606
Type:
Small organic molecule
Emp. Form.:
C10H14N6OS
Mol. Mass.:
266.323
SMILES:
CNc1ncnc2n(cnc12)[C@@H]1SC[C@@H](N)[C@H]1O
: