Target
Ricin
Ligand
BDBM50580240
Substrate
Meas. Tech.
ChEMBL_2147704 (CHEMBL5032050)
IC50
181000±n/a nM
Citation
 Li, XPHarijan, RKCao, BKahn, JNPierce, MTsymbal, AMRoberge, JYAugeri, DTumer, NE Synthesis and Structural Characterization of Ricin Inhibitors Targeting Ribosome Binding Using Fragment-Based Methods and Structure-Based Design. J Med Chem 64:15334-15348 (2021)  
Target
Name:
Ricin
Synonyms:
RICI_RICCO
Type:
PROTEIN
Mol. Mass.:
64090.82
Organism:
Ricinus communis
Description:
ChEMBL_1286970
Residue:
576
  
Inhibitor
Name:
BDBM50580240
Synonyms:
CHEMBL3951007
Type:
Small organic molecule
Emp. Form.:
C11H8O2S
Mol. Mass.:
204.245
SMILES:
OC(=O)c1ccc(s1)-c1ccccc1
: