Target
Ricin
Ligand
BDBM50580244
Substrate
Meas. Tech.
ChEMBL_2147708 (CHEMBL5032054)
IC50
48000±n/a nM
Citation
 Li, XPHarijan, RKCao, BKahn, JNPierce, MTsymbal, AMRoberge, JYAugeri, DTumer, NE Synthesis and Structural Characterization of Ricin Inhibitors Targeting Ribosome Binding Using Fragment-Based Methods and Structure-Based Design. J Med Chem 64:15334-15348 (2021)  
Target
Name:
Ricin
Synonyms:
RICI_RICCO
Type:
PROTEIN
Mol. Mass.:
64090.82
Organism:
Ricinus communis
Description:
ChEMBL_1286970
Residue:
576
  
Inhibitor
Name:
BDBM50580244
Synonyms:
CHEMBL5090353
Type:
Small organic molecule
Emp. Form.:
C14H14O2S
Mol. Mass.:
246.325
SMILES:
Cc1cc(C)c(-c2ccc(s2)C(O)=O)c(C)c1
: