Target
Ricin
Ligand
BDBM50580246
Substrate
Meas. Tech.
ChEMBL_2147708 (CHEMBL5032054)
IC50
15000±n/a nM
Citation
 Li, XPHarijan, RKCao, BKahn, JNPierce, MTsymbal, AMRoberge, JYAugeri, DTumer, NE Synthesis and Structural Characterization of Ricin Inhibitors Targeting Ribosome Binding Using Fragment-Based Methods and Structure-Based Design. J Med Chem 64:15334-15348 (2021)  
Target
Name:
Ricin
Synonyms:
RICI_RICCO
Type:
PROTEIN
Mol. Mass.:
64090.82
Organism:
Ricinus communis
Description:
ChEMBL_1286970
Residue:
576
  
Inhibitor
Name:
BDBM50580246
Synonyms:
CHEMBL5077000
Type:
Small organic molecule
Emp. Form.:
C13H12O2S
Mol. Mass.:
232.298
SMILES:
CCc1ccccc1-c1ccc(s1)C(O)=O
: