Target
Lysophosphatidic acid receptor 2
Ligand
BDBM50148348
Substrate
Meas. Tech.
ChEBML_100176
EC50
6.8±n/a nM
Citation
 Santos, WLHeasley, BHJarosz, RCarter, KMLynch, KRMacdonald, TL Synthesis and biological evaluation of phosphonic and thiophosphoric acid derivatives of lysophosphatidic acid. Bioorg Med Chem Lett 14:3473-6 (2004)  
Target
Name:
Lysophosphatidic acid receptor 2
Synonyms:
EDG4 LPA-2 LPAR2 Lysophosphatidic acid receptor 2 | Lysophosphatidic acid receptor Edg-4
Type:
PROTEIN
Mol. Mass.:
39103.44
Organism:
Homo sapiens (Human)
Description:
ChEMBL_1451385
Residue:
351
  
Inhibitor
Name:
BDBM50148348
Synonyms:
(R)-Octadec-9-enoic acid 2-hydroxy-3-phosphonooxy-propyl ester CHEMBL117021 | lysophosphatidic acid
Type:
Small organic molecule
Emp. Form.:
C21H41O7P
Mol. Mass.:
436.5198
SMILES:
CCCCCCCC\C=C/CCCCCCCC(=O)OC[C@@H](O)COP(O)(O)=O
: