Target
Lysophosphatidic acid receptor 2
Ligand
BDBM50148354
Substrate
Meas. Tech.
ChEBML_100176
EC50
1960±n/a nM
Citation
 Santos, WLHeasley, BHJarosz, RCarter, KMLynch, KRMacdonald, TL Synthesis and biological evaluation of phosphonic and thiophosphoric acid derivatives of lysophosphatidic acid. Bioorg Med Chem Lett 14:3473-6 (2004)  
Target
Name:
Lysophosphatidic acid receptor 2
Synonyms:
EDG4 LPA-2 LPAR2 Lysophosphatidic acid receptor 2 | Lysophosphatidic acid receptor Edg-4
Type:
PROTEIN
Mol. Mass.:
39103.44
Organism:
Homo sapiens (Human)
Description:
ChEMBL_1451385
Residue:
351
  
Inhibitor
Name:
BDBM50148354
Synonyms:
CHEMBL117663 | [1-Fluoro-3-((Z)-octadec-9-enoylamino)-propyl]-phosphonic acid
Type:
Small organic molecule
Emp. Form.:
C21H41FNO4P
Mol. Mass.:
421.5267
SMILES:
CCCCCCCC\C=C/CCCCCCCC(=O)NCCC(F)P(O)(O)=O
: