Target
Lysophosphatidic acid receptor 2
Ligand
BDBM50148426
Substrate
Meas. Tech.
ChEBML_201449
IC50
120±n/a nM
Citation
 Hale, JJDoherty, GToth, LMills, SGHajdu, RKeohane, CARosenbach, MMilligan, JShei, GJChrebet, GBergstrom, JCard, DForrest, MSun, SYWest, SXie, HNomura, NRosen, HMandala, S Selecting against S1P3 enhances the acute cardiovascular tolerability of 3-(N-benzyl)aminopropylphosphonic acid S1P receptor agonists. Bioorg Med Chem Lett 14:3501-5 (2004)  
Target
Name:
Lysophosphatidic acid receptor 2
Synonyms:
EDG4 LPA-2 LPAR2 Lysophosphatidic acid receptor 2 | Lysophosphatidic acid receptor Edg-4
Type:
PROTEIN
Mol. Mass.:
39103.44
Organism:
Homo sapiens (Human)
Description:
ChEMBL_1451385
Residue:
351
  
Inhibitor
Name:
BDBM50148426
Synonyms:
CHEMBL323617 | {3-[4-(5-Heptyl-[1,2,4]oxadiazol-3-yl)-benzylamino]-propyl}-phosphonic acid
Type:
Small organic molecule
Emp. Form.:
C19H30N3O4P
Mol. Mass.:
395.433
SMILES:
CCCCCCCc1nc(no1)-c1ccc(CNCCCP(O)(O)=O)cc1
: