Target
Diacylglycerol acyltransferase/mycolyltransferase Ag85C
Ligand
BDBM50148584
Substrate
Meas. Tech.
ChEBML_35860
IC50
42550±n/a nM
Citation
 Gobec, SPlantan, IMravljak, JWilson, RABesra, GSKikelj, D Phosphonate inhibitors of antigen 85C, a crucial enzyme involved in the biosynthesis of the Mycobacterium tuberculosis cell wall. Bioorg Med Chem Lett 14:3559-62 (2004)  
Target
Name:
Diacylglycerol acyltransferase/mycolyltransferase Ag85C
Synonyms:
A85C_MYCTU fbpC | mpt45
Type:
PROTEIN
Mol. Mass.:
36770.32
Organism:
Mycobacterium tuberculosis
Description:
ChEMBL_431881
Residue:
340
  
Inhibitor
Name:
BDBM50148584
Synonyms:
CHEMBL118790 | Hexyl-phosphonic acid ethyl ester 3-phenoxy-benzyl ester
Type:
Small organic molecule
Emp. Form.:
C21H29O4P
Mol. Mass.:
376.4263
SMILES:
CCCCCCP(=O)(OCC)OCc1cccc(Oc2ccccc2)c1
: