Target
Peroxisome proliferator-activated receptor delta
Ligand
BDBM50401994
Substrate
Meas. Tech.
ChEMBL_2149038 (CHEMBL5033436)
EC50
2800±n/a nM
Citation
 Willems, SMorstein, JHinnah, KTrauner, DMerk, D A Photohormone for Light-Dependent Control of PPAR? in Live Cells. J Med Chem 64:10393-10402 (2021)  
Target
Name:
Peroxisome proliferator-activated receptor delta
Synonyms:
NR1C2 NUCI Nuclear receptor subfamily 1 group C member 2 PPAR-beta PPARD Peroxisome proliferator-activated receptor Peroxisome proliferator-activated receptor delta
Type:
Enzyme
Mol. Mass.:
49910.45
Organism:
Homo sapiens (Human)
Description:
Q03181
Residue:
441
  
Inhibitor
Name:
BDBM50401994
Synonyms:
CHEMBL2204695
Type:
Small organic molecule
Emp. Form.:
C23H22N2O4
Mol. Mass.:
390.4318
SMILES:
CC(C)(Oc1ccc(COc2ccc(cc2)\N=N\c2ccccc2)cc1)C(O)=O
: