Target
Peroxisome proliferator-activated receptor delta
Ligand
BDBM50580798
Substrate
Meas. Tech.
ChEMBL_2149038 (CHEMBL5033436)
EC50
3400±n/a nM
Citation
 Willems, SMorstein, JHinnah, KTrauner, DMerk, D A Photohormone for Light-Dependent Control of PPAR? in Live Cells. J Med Chem 64:10393-10402 (2021)  
Target
Name:
Peroxisome proliferator-activated receptor delta
Synonyms:
NR1C2 NUCI Nuclear receptor subfamily 1 group C member 2 PPAR-beta PPARD Peroxisome proliferator-activated receptor Peroxisome proliferator-activated receptor delta
Type:
Enzyme
Mol. Mass.:
49910.45
Organism:
Homo sapiens (Human)
Description:
Q03181
Residue:
441
  
Inhibitor
Name:
BDBM50580798
Synonyms:
CHEMBL5093865
Type:
Small organic molecule
Emp. Form.:
C27H30N2O4
Mol. Mass.:
446.5381
SMILES:
CC(C)c1ccc(cc1)\N=N/c1ccc(OCCc2ccc(OC(C)(C)C(O)=O)cc2)cc1
: