Target
Peroxisome proliferator-activated receptor gamma
Ligand
BDBM50580794
Substrate
Meas. Tech.
ChEMBL_2149040 (CHEMBL5033438)
EC50
>10000±n/a nM
Citation
 Willems, SMorstein, JHinnah, KTrauner, DMerk, D A Photohormone for Light-Dependent Control of PPAR? in Live Cells. J Med Chem 64:10393-10402 (2021)  
Target
Name:
Peroxisome proliferator-activated receptor gamma
Synonyms:
NR1C3 PPAR-gamma PPARG_HUMAN Peroxisome proliferator-activated receptor gamma (PPAR gamma) Peroxisome proliferator-activated receptor gamma (PPARĪ³) peroxisome proliferator-activated receptor gamma isoform 2
Type:
Nuclear Receptor
Mol. Mass.:
57613.46
Organism:
Homo sapiens (Human)
Description:
P37231
Residue:
505
  
Inhibitor
Name:
BDBM50580794
Synonyms:
CHEMBL5090949
Type:
Small organic molecule
Emp. Form.:
C25H26N2O4
Mol. Mass.:
418.4849
SMILES:
Cc1ccc(cc1)\N=N\c1ccc(OCCc2ccc(OC(C)(C)C(O)=O)cc2)cc1
: