Target
Amine oxidase [flavin-containing] A
Ligand
BDBM50148808
Substrate
Meas. Tech.
ChEMBL_123279 (CHEMBL731800)
IC50
63100.0±n/a nM
Citation
 Velezheva, VSBrennan, PJMarshakov, VYGusev, DVLisichkina, INPeregudov, ASTchernousova, LNSmirnova, TGAndreevskaya, SNMedvedev, AE Novel pyridazino[4,3-b]indoles with dual inhibitory activity against Mycobacterium tuberculosis and monoamine oxidase. J Med Chem 47:3455-61 (2004)  
Target
Name:
Amine oxidase [flavin-containing] A
Synonyms:
AOFA_RAT Amine oxidase [flavin-containing] A Monoamine Oxidase Type A (MAO-A) Monoamine oxidase A (MAO-A) Monoamine oxidase type A (MAOA)
Type:
Enzyme
Mol. Mass.:
59515.21
Organism:
Rattus norvegicus (rat)
Description:
Residue:
526
  
Inhibitor
Name:
BDBM50148808
Synonyms:
4-(3-Bromo-phenyl)-5-methyl-5H-pyridazino[4,3-b]indol-3-ylamine | CHEMBL116983
Type:
Small organic molecule
Emp. Form.:
C17H13BrN4
Mol. Mass.:
353.216
SMILES:
Cn1c2ccccc2c2nnc(N)c(-c3cccc(Br)c3)c12
: