Target
Amine oxidase [flavin-containing] A
Ligand
BDBM50148813
Substrate
Meas. Tech.
ChEMBL_123279 (CHEMBL731800)
IC50
63000±n/a nM
Citation
 Velezheva, VSBrennan, PJMarshakov, VYGusev, DVLisichkina, INPeregudov, ASTchernousova, LNSmirnova, TGAndreevskaya, SNMedvedev, AE Novel pyridazino[4,3-b]indoles with dual inhibitory activity against Mycobacterium tuberculosis and monoamine oxidase. J Med Chem 47:3455-61 (2004)  
Target
Name:
Amine oxidase [flavin-containing] A
Synonyms:
AOFA_RAT Amine oxidase [flavin-containing] A Monoamine Oxidase Type A (MAO-A) Monoamine oxidase A (MAO-A) Monoamine oxidase type A (MAOA)
Type:
Enzyme
Mol. Mass.:
59515.21
Organism:
Rattus norvegicus (rat)
Description:
Residue:
526
  
Inhibitor
Name:
BDBM50148813
Synonyms:
8-Bromo-4-(4-isopropyl-phenyl)-5H-pyridazino[4,3-b]indol-3-ylamine | CHEMBL114900
Type:
Small organic molecule
Emp. Form.:
C19H17BrN4
Mol. Mass.:
381.269
SMILES:
CC(C)c1ccc(cc1)-c1c(N)nnc2c3cc(Br)ccc3[nH]c12
: