Target
Amine oxidase [flavin-containing] A
Ligand
BDBM50148819
Substrate
Meas. Tech.
ChEMBL_123279 (CHEMBL731800)
IC50
28200±n/a nM
Citation
 Velezheva, VSBrennan, PJMarshakov, VYGusev, DVLisichkina, INPeregudov, ASTchernousova, LNSmirnova, TGAndreevskaya, SNMedvedev, AE Novel pyridazino[4,3-b]indoles with dual inhibitory activity against Mycobacterium tuberculosis and monoamine oxidase. J Med Chem 47:3455-61 (2004)  
Target
Name:
Amine oxidase [flavin-containing] A
Synonyms:
AOFA_RAT Amine oxidase [flavin-containing] A Monoamine Oxidase Type A (MAO-A) Monoamine oxidase A (MAO-A) Monoamine oxidase type A (MAOA)
Type:
Enzyme
Mol. Mass.:
59515.21
Organism:
Rattus norvegicus (rat)
Description:
Residue:
526
  
Inhibitor
Name:
BDBM50148819
Synonyms:
5-Methyl-4-phenyl-5H-pyridazino[4,3-b]indol-3-ylamine | CHEMBL114475
Type:
Small organic molecule
Emp. Form.:
C17H14N4
Mol. Mass.:
274.3199
SMILES:
Cn1c2ccccc2c2nnc(N)c(-c3ccccc3)c12
: