Target
Amine oxidase [flavin-containing] B
Ligand
BDBM50148808
Substrate
Meas. Tech.
ChEMBL_124228 (CHEMBL733982)
IC50
100000±n/a nM
Citation
 Velezheva, VSBrennan, PJMarshakov, VYGusev, DVLisichkina, INPeregudov, ASTchernousova, LNSmirnova, TGAndreevskaya, SNMedvedev, AE Novel pyridazino[4,3-b]indoles with dual inhibitory activity against Mycobacterium tuberculosis and monoamine oxidase. J Med Chem 47:3455-61 (2004)  
Target
Name:
Amine oxidase [flavin-containing] B
Synonyms:
AOFB_RAT Amine oxidase [flavin-containing] B Monoamine Oxidase Type B (MAO-B) Monoamine oxidase B (MAO-B) Monoamine oxidase type B (MAOB) | Monoamine oxidase-B (MAO-B)
Type:
Enzyme
Mol. Mass.:
58469.65
Organism:
Rattus norvegicus (rat)
Description:
P19643
Residue:
520
  
Inhibitor
Name:
BDBM50148808
Synonyms:
4-(3-Bromo-phenyl)-5-methyl-5H-pyridazino[4,3-b]indol-3-ylamine | CHEMBL116983
Type:
Small organic molecule
Emp. Form.:
C17H13BrN4
Mol. Mass.:
353.216
SMILES:
Cn1c2ccccc2c2nnc(N)c(-c3cccc(Br)c3)c12
: