Target
Amine oxidase [flavin-containing] B
Ligand
BDBM50148818
Substrate
Meas. Tech.
ChEMBL_124228 (CHEMBL733982)
IC50
>1000000±n/a nM
Citation
 Velezheva, VSBrennan, PJMarshakov, VYGusev, DVLisichkina, INPeregudov, ASTchernousova, LNSmirnova, TGAndreevskaya, SNMedvedev, AE Novel pyridazino[4,3-b]indoles with dual inhibitory activity against Mycobacterium tuberculosis and monoamine oxidase. J Med Chem 47:3455-61 (2004)  
Target
Name:
Amine oxidase [flavin-containing] B
Synonyms:
AOFB_RAT Amine oxidase [flavin-containing] B Monoamine Oxidase Type B (MAO-B) Monoamine oxidase B (MAO-B) Monoamine oxidase type B (MAOB) | Monoamine oxidase-B (MAO-B)
Type:
Enzyme
Mol. Mass.:
58469.65
Organism:
Rattus norvegicus (rat)
Description:
P19643
Residue:
520
  
Inhibitor
Name:
BDBM50148818
Synonyms:
4-(4-Isopropyl-phenyl)-5H-pyridazino[4,3-b]indol-3-ylamine | CHEMBL113651
Type:
Small organic molecule
Emp. Form.:
C19H18N4
Mol. Mass.:
302.373
SMILES:
CC(C)c1ccc(cc1)-c1c(N)nnc2c3ccccc3[nH]c12
: