Target
Amine oxidase [flavin-containing] B
Ligand
BDBM50148821
Substrate
Meas. Tech.
ChEMBL_124228 (CHEMBL733982)
IC50
15800±n/a nM
Citation
 Velezheva, VSBrennan, PJMarshakov, VYGusev, DVLisichkina, INPeregudov, ASTchernousova, LNSmirnova, TGAndreevskaya, SNMedvedev, AE Novel pyridazino[4,3-b]indoles with dual inhibitory activity against Mycobacterium tuberculosis and monoamine oxidase. J Med Chem 47:3455-61 (2004)  
Target
Name:
Amine oxidase [flavin-containing] B
Synonyms:
AOFB_RAT Amine oxidase [flavin-containing] B Monoamine Oxidase Type B (MAO-B) Monoamine oxidase B (MAO-B) Monoamine oxidase type B (MAOB) | Monoamine oxidase-B (MAO-B)
Type:
Enzyme
Mol. Mass.:
58469.65
Organism:
Rattus norvegicus (rat)
Description:
P19643
Residue:
520
  
Inhibitor
Name:
BDBM50148821
Synonyms:
5-Ethyl-4-(4-isopropyl-phenyl)-5H-pyridazino[4,3-b]indol-3-ylamine | CHEMBL116801
Type:
Small organic molecule
Emp. Form.:
C21H22N4
Mol. Mass.:
330.4262
SMILES:
CCn1c2ccccc2c2nnc(N)c(-c3ccc(cc3)C(C)C)c12
: