Target
Corticotropin-releasing factor receptor 1
Ligand
BDBM50148885
Substrate
Meas. Tech.
ChEBML_51104
Ki
11±n/a nM
Citation
 Chen, CWilcoxen, KMHuang, CQMcCarthy, JRChen, TGrigoriadis, DE Optimization of 3-phenylpyrazolo[1,5-a]pyrimidines as potent corticotropin-releasing factor-1 antagonists with adequate lipophilicity and water solubility. Bioorg Med Chem Lett 14:3669-73 (2004)  
Target
Name:
Corticotropin-releasing factor receptor 1
Synonyms:
CRF-R CRF1 CRFR1 CRH-R 1 CRHR1 Corticotropin-releasing factor receptor 1 (CRF-1) Corticotropin-releasing hormone receptor 1
Type:
Enzyme
Mol. Mass.:
50744.31
Organism:
Homo sapiens (Human)
Description:
P34998
Residue:
444
  
Inhibitor
Name:
BDBM50148885
Synonyms:
CHEMBL330954 | [3-(4-Chloro-phenyl)-7-dipropylamino-5-methyl-3H-pyrazolo[1,5-a]pyrimidin-2-yl]-methanol
Type:
Small organic molecule
Emp. Form.:
C20H25ClN4O
Mol. Mass.:
372.892
SMILES:
CCCN(CCC)c1cc(C)nc2c(c(CO)nn12)-c1ccc(Cl)cc1
: