Target
Urea transporter 1
Ligand
BDBM50580906
Substrate
Meas. Tech.
ChEMBL_2149291 (CHEMBL5033689)
IC50
110±n/a nM
Citation
 Wang, SXu, YZhao, YZhang, SLi, MLi, XHe, JZhou, HGe, ZLi, RYang, B N-(4-acetamidophenyl)-5-acetylfuran-2-carboxamide as a novel orally available diuretic that targets urea transporters with improved PD and PK properties. Eur J Med Chem 226:0 (2021)  
Target
Name:
Urea transporter 1
Synonyms:
Slc14a1 UT1_RAT Urea transporter B (UT-B)
Type:
Protein
Mol. Mass.:
42037.85
Organism:
Rattus norvegicus (Rat)
Description:
Residue:
384
  
Inhibitor
Name:
BDBM50580906
Synonyms:
CHEMBL5074722
Type:
Small organic molecule
Emp. Form.:
C17H13N3O6S
Mol. Mass.:
387.367
SMILES:
[O-][N+](=O)c1ccc(o1)C(=O)Nc1ccc(NS(=O)(=O)c2ccccc2)cc1
: