Target
Urea transporter 1
Ligand
BDBM50580922
Substrate
Meas. Tech.
ChEMBL_2149292 (CHEMBL5033690)
IC50
160±n/a nM
Citation
 Wang, SXu, YZhao, YZhang, SLi, MLi, XHe, JZhou, HGe, ZLi, RYang, B N-(4-acetamidophenyl)-5-acetylfuran-2-carboxamide as a novel orally available diuretic that targets urea transporters with improved PD and PK properties. Eur J Med Chem 226:0 (2021)  
Target
Name:
Urea transporter 1
Synonyms:
Slc14a1 UT-B Urea transporter B | Urea transporter, erythrocyte
Type:
PROTEIN
Mol. Mass.:
42130.98
Organism:
Mus musculus
Description:
ChEMBL_964780
Residue:
384
  
Inhibitor
Name:
BDBM50580922
Synonyms:
CHEMBL5087071
Type:
Small organic molecule
Emp. Form.:
C19H16N2O5S
Mol. Mass.:
384.406
SMILES:
CC(=O)c1ccc(o1)C(=O)Nc1ccc(NS(=O)(=O)c2ccccc2)cc1
: