Target
Cell division protein FtsZ
Ligand
BDBM50581023
Substrate
Meas. Tech.
ChEMBL_2149614 (CHEMBL5034076)
Kd
9500±n/a nM
Citation
 Huecas, SAraújo-Bazán, LRuiz, FMRuiz-Ávila, LBMartínez, RFEscobar-Peńa, AArtola, MVázquez-Villa, HMartín-Fontecha, MFernández-Tornero, CLópez-Rodríguez, MLAndreu, JM Targeting the FtsZ Allosteric Binding Site with a Novel Fluorescence Polarization Screen, Cytological and Structural Approaches for Antibacterial Discovery. J Med Chem 64:5730-5745 (2021)  
Target
Name:
Cell division protein FtsZ
Synonyms:
Type:
PROTEIN
Mol. Mass.:
40375.29
Organism:
Bacillus subtilis
Description:
ChEMBL_107642
Residue:
382
  
Inhibitor
Name:
BDBM50581023
Synonyms:
CHEMBL5079700
Type:
Small organic molecule
Emp. Form.:
C16H16ClNO2
Mol. Mass.:
289.757
SMILES:
NC(=O)c1cccc(OCCCc2cccc(Cl)c2)c1
: