Target
Cell division protein FtsZ
Ligand
BDBM50581030
Substrate
Meas. Tech.
ChEMBL_2149614 (CHEMBL5034076)
Kd
145000±n/a nM
Citation
 Huecas, SAraújo-Bazán, LRuiz, FMRuiz-Ávila, LBMartínez, RFEscobar-Peńa, AArtola, MVázquez-Villa, HMartín-Fontecha, MFernández-Tornero, CLópez-Rodríguez, MLAndreu, JM Targeting the FtsZ Allosteric Binding Site with a Novel Fluorescence Polarization Screen, Cytological and Structural Approaches for Antibacterial Discovery. J Med Chem 64:5730-5745 (2021)  
Target
Name:
Cell division protein FtsZ
Synonyms:
Type:
PROTEIN
Mol. Mass.:
40375.29
Organism:
Bacillus subtilis
Description:
ChEMBL_107642
Residue:
382
  
Inhibitor
Name:
BDBM50581030
Synonyms:
CHEMBL5091172
Type:
Small organic molecule
Emp. Form.:
C19H19F5N2O2
Mol. Mass.:
402.3584
SMILES:
CN(C)CCC(Oc1ccc(F)c(C(N)=O)c1F)c1cccc(c1)C(F)(F)F
: