Target
Beta-secretase 1
Ligand
BDBM50581133
Substrate
Meas. Tech.
ChEMBL_2149733 (CHEMBL5034195)
IC50
324±n/a nM
Citation
 McKinzie, DLWinneroski, LLGreen, SJHembre, EJErickson, JAWillis, BAMonk, SAAluise, CDBaker, TKLopez, JEHendle, JBeck, JPBrier, RABoggs, LNBorders, ARCocke, PJGarcia-Losada, PLowe, SLMathes, BMMay, PCPorter, WJStout, SLTimm, DEWatson, BMYang, ZMergott, DJ Discovery and Early Clinical Development of LY3202626, a Low-Dose, CNS-Penetrant BACE Inhibitor. J Med Chem 64:8076-8100 (2021)  
Target
Name:
Beta-secretase 1
Synonyms:
BACE1_MOUSE Bace1 Beta-secretase 1 (BACE1)
Type:
Enzyme
Mol. Mass.:
55739.56
Organism:
Mus musculus (Mouse)
Description:
P56818
Residue:
501
  
Inhibitor
Name:
BDBM50581133
Synonyms:
CHEMBL5093835
Type:
Small organic molecule
Emp. Form.:
C14H15ClFN5S2
Mol. Mass.:
371.884
SMILES:
Cl.[H][C@@]12CN(C[C@@]1(N=C(N)SC2)c1cccs1)c1ncc(F)cn1
: