Target
Potassium voltage-gated channel subfamily H member 2
Ligand
BDBM150688
Substrate
Meas. Tech.
ChEMBL_2149749 (CHEMBL5034211)
IC50
180±n/a nM
Citation
 McKinzie, DLWinneroski, LLGreen, SJHembre, EJErickson, JAWillis, BAMonk, SAAluise, CDBaker, TKLopez, JEHendle, JBeck, JPBrier, RABoggs, LNBorders, ARCocke, PJGarcia-Losada, PLowe, SLMathes, BMMay, PCPorter, WJStout, SLTimm, DEWatson, BMYang, ZMergott, DJ Discovery and Early Clinical Development of LY3202626, a Low-Dose, CNS-Penetrant BACE Inhibitor. J Med Chem 64:8076-8100 (2021)  
Target
Name:
Potassium voltage-gated channel subfamily H member 2
Synonyms:
1,3-beta-glucan synthase component GLS2 ERG Eag-related protein 1 Ether-a-go-go-related gene (HERG) Ether-a-go-go-related gene potassium channel 1 Ether-a-go-go-related gene potassium channel 1 (hERG1) Ether-a-go-go-related protein 1 H-ERG KCNH2 Potassium voltage-gated channel subfamily H member 2 (hERG) Voltage-gated potassium channel subunit Kv11.1 hERG Potassium Channel 1 | putative potassium channel subunit
Type:
Multi-pass membrane protein
Mol. Mass.:
126672.65
Organism:
Homo sapiens (Human)
Description:
Q12809
Residue:
1159
  
Inhibitor
Name:
BDBM150688
Synonyms:
US8987254, 3 | US9999624, 3
Type:
Small organic molecule
Emp. Form.:
C22H18F3N7OS
Mol. Mass.:
485.485
SMILES:
NC1=N[C@]2(CN(C[C@H]2CS1)c1ncc(F)cn1)c1cc(NC(=O)c2ccc(F)cn2)ccc1F
: