Target
Potassium voltage-gated channel subfamily H member 2
Ligand
BDBM400979
Substrate
Meas. Tech.
ChEMBL_2149749 (CHEMBL5034211)
IC50
2600±n/a nM
Citation
 McKinzie, DLWinneroski, LLGreen, SJHembre, EJErickson, JAWillis, BAMonk, SAAluise, CDBaker, TKLopez, JEHendle, JBeck, JPBrier, RABoggs, LNBorders, ARCocke, PJGarcia-Losada, PLowe, SLMathes, BMMay, PCPorter, WJStout, SLTimm, DEWatson, BMYang, ZMergott, DJ Discovery and Early Clinical Development of LY3202626, a Low-Dose, CNS-Penetrant BACE Inhibitor. J Med Chem 64:8076-8100 (2021)  
Target
Name:
Potassium voltage-gated channel subfamily H member 2
Synonyms:
1,3-beta-glucan synthase component GLS2 ERG Eag-related protein 1 Ether-a-go-go-related gene (HERG) Ether-a-go-go-related gene potassium channel 1 Ether-a-go-go-related gene potassium channel 1 (hERG1) Ether-a-go-go-related protein 1 H-ERG KCNH2 Potassium voltage-gated channel subfamily H member 2 (hERG) Voltage-gated potassium channel subunit Kv11.1 hERG Potassium Channel 1 | putative potassium channel subunit
Type:
Multi-pass membrane protein
Mol. Mass.:
126672.65
Organism:
Homo sapiens (Human)
Description:
Q12809
Residue:
1159
  
Inhibitor
Name:
BDBM400979
Synonyms:
US9999624, Compound 4
Type:
Emp. Form.:
C22H20F2N8O2S
Mol. Mass.:
498.508
SMILES:
COc1cnc(cn1)C(=O)Nc1ccc(F)c(c1)[C@]12CN(C[C@H]1CSC(N)=N2)c1ncc(F)cn1
: