Target
Muscarinic acetylcholine receptor M3
Ligand
BDBM50581208
Substrate
Meas. Tech.
ChEMBL_2150070 (CHEMBL5034532)
Ki
12.6±n/a nM
Target
Name:
Muscarinic acetylcholine receptor M3
Synonyms:
ACM3_HUMAN Cholinergic, muscarinic M3 Muscarinic receptor M3 | RecName: Full=Muscarinic acetylcholine receptor M3
Type:
Enzyme
Mol. Mass.:
66151.03
Organism:
Homo sapiens (Human)
Description:
P20309
Residue:
590
  
Inhibitor
Name:
BDBM50581208
Synonyms:
CHEMBL5076535
Type:
Small organic molecule
Emp. Form.:
C33H35Cl2N3O7S
Mol. Mass.:
688.618
SMILES:
COc1ccc(cc1OC)[C@H](Cc1c(Cl)c[n+]([O-])cc1Cl)OC(=O)c1ccc(CNC(C(=O)OCCN(C)C)c2ccccc2)s1
: