Target
cAMP-specific 3',5'-cyclic phosphodiesterase 4B
Ligand
BDBM50581208
Substrate
Meas. Tech.
ChEMBL_2150073 (CHEMBL5034535)
IC50
1.000000±n/a nM
Target
Name:
cAMP-specific 3',5'-cyclic phosphodiesterase 4B
Synonyms:
3',5'-cyclic phosphodiesterase Isoform PDE4B1 PDE4B PDE4B_HUMAN Phosphodiesterase 4B (PDE4B) Phosphodiesterase Type 4 (PDE4B)
Type:
Protein
Mol. Mass.:
83318.87
Organism:
Homo sapiens (Human)
Description:
Q07343
Residue:
736
  
Inhibitor
Name:
BDBM50581208
Synonyms:
CHEMBL5076535
Type:
Small organic molecule
Emp. Form.:
C33H35Cl2N3O7S
Mol. Mass.:
688.618
SMILES:
COc1ccc(cc1OC)[C@H](Cc1c(Cl)c[n+]([O-])cc1Cl)OC(=O)c1ccc(CNC(C(=O)OCCN(C)C)c2ccccc2)s1
: