Target
Muscarinic acetylcholine receptor M3
Ligand
BDBM325606
Substrate
Meas. Tech.
ChEMBL_2150080 (CHEMBL5034542)
IC50
20±n/a nM
Target
Name:
Muscarinic acetylcholine receptor M3
Synonyms:
ACM3_RAT Chrm-3 | Chrm3
Type:
Enzyme Catalytic Domain
Mol. Mass.:
66086.66
Organism:
RAT
Description:
Cholinergic, muscarinic M3 CHRM3 RAT::P08483
Residue:
589
  
Inhibitor
Name:
BDBM325606
Synonyms:
US9636336, Example 87c
Type:
Small organic molecule
Emp. Form.:
C35H37Cl2N3O7S
Mol. Mass.:
714.655
SMILES:
COc1ccc(cc1OC)[C@H](Cc1c(Cl)c[n+]([O-])cc1Cl)OC(=O)c1ccc(CNC(C(=O)OC2CCN(C)CC2)c2ccccc2)s1
: