Target
Muscarinic acetylcholine receptor M3
Ligand
BDBM50581208
Substrate
Meas. Tech.
ChEMBL_2150080 (CHEMBL5034542)
IC50
79±n/a nM
Target
Name:
Muscarinic acetylcholine receptor M3
Synonyms:
ACM3_RAT Chrm-3 | Chrm3
Type:
Enzyme Catalytic Domain
Mol. Mass.:
66086.66
Organism:
RAT
Description:
Cholinergic, muscarinic M3 CHRM3 RAT::P08483
Residue:
589
  
Inhibitor
Name:
BDBM50581208
Synonyms:
CHEMBL5076535
Type:
Small organic molecule
Emp. Form.:
C33H35Cl2N3O7S
Mol. Mass.:
688.618
SMILES:
COc1ccc(cc1OC)[C@H](Cc1c(Cl)c[n+]([O-])cc1Cl)OC(=O)c1ccc(CNC(C(=O)OCCN(C)C)c2ccccc2)s1
: