Target
Bifunctional epoxide hydrolase 2
Ligand
BDBM50581278
Substrate
Meas. Tech.
ChEMBL_2150272 (CHEMBL5034734)
IC50
7.8±n/a nM
Citation
 Helmstädter, MKaiser, ABrunst, SSchmidt, JRonchetti, RWeizel, LProschak, EMerk, D Second-Generation Dual FXR/sEH Modulators with Optimized Pharmacokinetics. J Med Chem 64:9525-9536 (2021)  
Target
Name:
Bifunctional epoxide hydrolase 2
Synonyms:
Cytosolic epoxide hydrolase 2 EPHX2 HYES_HUMAN Soluble epoxide hydrolase (sEH) | epoxide hydrolase 2, cytoplasmic
Type:
Enzyme
Mol. Mass.:
62613.07
Organism:
Homo sapiens (Human)
Description:
P34913
Residue:
555
  
Inhibitor
Name:
BDBM50581278
Synonyms:
CHEMBL5081303
Type:
Small organic molecule
Emp. Form.:
C21H25ClN2O3S
Mol. Mass.:
420.953
SMILES:
CC(C)(C)c1ccc(cc1)C(=O)NCc1ccc(NS(=O)(=O)C2CC2)cc1Cl
: