Target
Bifunctional epoxide hydrolase 2
Ligand
BDBM50581272
Substrate
Meas. Tech.
ChEMBL_2150272 (CHEMBL5034734)
IC50
4.0±n/a nM
Citation
 Helmstädter, MKaiser, ABrunst, SSchmidt, JRonchetti, RWeizel, LProschak, EMerk, D Second-Generation Dual FXR/sEH Modulators with Optimized Pharmacokinetics. J Med Chem 64:9525-9536 (2021)  
Target
Name:
Bifunctional epoxide hydrolase 2
Synonyms:
Cytosolic epoxide hydrolase 2 EPHX2 HYES_HUMAN Soluble epoxide hydrolase (sEH) | epoxide hydrolase 2, cytoplasmic
Type:
Enzyme
Mol. Mass.:
62613.07
Organism:
Homo sapiens (Human)
Description:
P34913
Residue:
555
  
Inhibitor
Name:
BDBM50581272
Synonyms:
CHEMBL5086882
Type:
Small organic molecule
Emp. Form.:
C17H14ClF5N2O3S
Mol. Mass.:
456.815
SMILES:
CS(=O)(=O)Nc1ccc(CNC(=O)c2ccc(cc2)C(F)(F)C(F)(F)F)c(Cl)c1
: