Target
Cruzipain
Ligand
BDBM50286450
Substrate
Meas. Tech.
ChEMBL_2150847 (CHEMBL5035309)
Ki
0.440000±n/a nM
Citation
 Li, LChenna, BCYang, KSCole, TRGoodall, ZTGiardini, MMoghadamchargari, ZHernandez, EAGomez, JCalvet, CMBernatchez, JAMellott, DMZhu, JRademacher, AThomas, DBlankenship, LRDrelich, ALaganowsky, ATseng, CKLiu, WRWand, AJCruz-Reyes, JSiqueira-Neto, JLMeek, TD Self-Masked Aldehyde Inhibitors: A Novel Strategy for Inhibiting Cysteine Proteases. J Med Chem 64:11267-11287 (2021)  
Target
Name:
Cruzipain
Synonyms:
CYSP_TRYCR Cruzaine | Major cysteine proteinase
Type:
Protein
Mol. Mass.:
49831.41
Organism:
Trypanosoma cruzi
Description:
P25779
Residue:
467
  
Inhibitor
Name:
BDBM50286450
Synonyms:
CHEMBL128135 | [(S)-1-((S)-1-Benzyl-2-oxo-ethylcarbamoyl)-2-phenyl-ethyl]-carbamic acid benzyl ester
Type:
Small organic molecule
Emp. Form.:
C26H26N2O4
Mol. Mass.:
430.4956
SMILES:
O=C[C@H](Cc1ccccc1)NC(=O)[C@H](Cc1ccccc1)NC(=O)OCc1ccccc1
: