Target
Cruzipain
Ligand
BDBM50581370
Substrate
Meas. Tech.
ChEMBL_2150847 (CHEMBL5035309)
Ki
48±n/a nM
Citation
 Li, LChenna, BCYang, KSCole, TRGoodall, ZTGiardini, MMoghadamchargari, ZHernandez, EAGomez, JCalvet, CMBernatchez, JAMellott, DMZhu, JRademacher, AThomas, DBlankenship, LRDrelich, ALaganowsky, ATseng, CKLiu, WRWand, AJCruz-Reyes, JSiqueira-Neto, JLMeek, TD Self-Masked Aldehyde Inhibitors: A Novel Strategy for Inhibiting Cysteine Proteases. J Med Chem 64:11267-11287 (2021)  
Target
Name:
Cruzipain
Synonyms:
CYSP_TRYCR Cruzaine | Major cysteine proteinase
Type:
Protein
Mol. Mass.:
49831.41
Organism:
Trypanosoma cruzi
Description:
P25779
Residue:
467
  
Inhibitor
Name:
BDBM50581370
Synonyms:
CHEMBL5080091
Type:
Small organic molecule
Emp. Form.:
C26H25FN2O5
Mol. Mass.:
464.4855
SMILES:
OC1Oc2ccc(F)cc2C[C@@H]1NC(=O)[C@H](Cc1ccccc1)NC(=O)OCc1ccccc1
: