Target
Cruzipain
Ligand
BDBM50581374
Substrate
Meas. Tech.
ChEMBL_2150847 (CHEMBL5035309)
Ki
1000±n/a nM
Citation
 Li, LChenna, BCYang, KSCole, TRGoodall, ZTGiardini, MMoghadamchargari, ZHernandez, EAGomez, JCalvet, CMBernatchez, JAMellott, DMZhu, JRademacher, AThomas, DBlankenship, LRDrelich, ALaganowsky, ATseng, CKLiu, WRWand, AJCruz-Reyes, JSiqueira-Neto, JLMeek, TD Self-Masked Aldehyde Inhibitors: A Novel Strategy for Inhibiting Cysteine Proteases. J Med Chem 64:11267-11287 (2021)  
Target
Name:
Cruzipain
Synonyms:
CYSP_TRYCR Cruzaine | Major cysteine proteinase
Type:
Protein
Mol. Mass.:
49831.41
Organism:
Trypanosoma cruzi
Description:
P25779
Residue:
467
  
Inhibitor
Name:
BDBM50581374
Synonyms:
CHEMBL5091908
Type:
Small organic molecule
Emp. Form.:
C26H32N4O5
Mol. Mass.:
480.5561
SMILES:
CN1CCN(CC1)C(=O)N[C@@H](Cc1ccccc1)C(=O)N[C@H]1Cc2ccccc2OC1OC(C)=O
: