Target
Cruzipain
Ligand
BDBM50581375
Substrate
Meas. Tech.
ChEMBL_2150847 (CHEMBL5035309)
Ki
>5000±n/a nM
Citation
 Li, LChenna, BCYang, KSCole, TRGoodall, ZTGiardini, MMoghadamchargari, ZHernandez, EAGomez, JCalvet, CMBernatchez, JAMellott, DMZhu, JRademacher, AThomas, DBlankenship, LRDrelich, ALaganowsky, ATseng, CKLiu, WRWand, AJCruz-Reyes, JSiqueira-Neto, JLMeek, TD Self-Masked Aldehyde Inhibitors: A Novel Strategy for Inhibiting Cysteine Proteases. J Med Chem 64:11267-11287 (2021)  
Target
Name:
Cruzipain
Synonyms:
CYSP_TRYCR Cruzaine | Major cysteine proteinase
Type:
Protein
Mol. Mass.:
49831.41
Organism:
Trypanosoma cruzi
Description:
P25779
Residue:
467
  
Inhibitor
Name:
BDBM50581375
Synonyms:
CHEMBL5092503
Type:
Small organic molecule
Emp. Form.:
C27H34N4O5
Mol. Mass.:
494.5827
SMILES:
CCC(=O)OC1Oc2ccccc2C[C@@H]1NC(=O)[C@H](Cc1ccccc1)NC(=O)N1CCN(C)CC1
: