Target
D(4) dopamine receptor
Ligand
BDBM50149711
Substrate
Meas. Tech.
ChEMBL_303008 (CHEMBL830247)
Ki
31±n/a nM
Citation
 Hocke, CPrante, OLöber, SHübner, HGmeiner, PKuwert, T Synthesis and radioiodination of selective ligands for the dopamine D3 receptor subtype. Bioorg Med Chem Lett 14:3963-6 (2004)  
Target
Name:
D(4) dopamine receptor
Synonyms:
D(2C) dopamine receptor DOPAMINE D4.2 DRD4 Dopamine D4 receptor
Type:
Enzyme
Mol. Mass.:
48373.19
Organism:
Homo sapiens (Human)
Description:
P21917
Residue:
419
  
Inhibitor
Name:
BDBM50149711
Synonyms:
5-Iodo-thiophene-2-carboxylic acid {4-[4-(2-methoxy-phenyl)-piperazin-1-yl]-butyl}-amide | CHEMBL182652
Type:
Small organic molecule
Emp. Form.:
C20H26IN3O2S
Mol. Mass.:
499.409
SMILES:
COc1ccccc1N1CCN(CCCCNC(=O)c2ccc(I)s2)CC1
: