Target
Dolichyl-phosphate-mannose--protein mannosyltransferase 1
Ligand
BDBM50149747
Substrate
Meas. Tech.
ChEMBL_304888 (CHEMBL877327)
IC50
11000±n/a nM
Citation
 Orchard, MGNeuss, JCGalley, CMCarr, APorter, DWSmith, PScopes, DIHaydon, DVousden, KStubberfield, CRYoung, KPage, M Rhodanine-3-acetic acid derivatives as inhibitors of fungal protein mannosyl transferase 1 (PMT1). Bioorg Med Chem Lett 14:3975-8 (2004)  
Target
Name:
Dolichyl-phosphate-mannose--protein mannosyltransferase 1
Synonyms:
PMT1 | PMT1_CANAL
Type:
PROTEIN
Mol. Mass.:
99941.72
Organism:
Candida albicans
Description:
ChEMBL_304888
Residue:
877
  
Inhibitor
Name:
BDBM50149747
Synonyms:
CHEMBL185513 | {5-[1-[4-Benzyloxy-3-(3-trifluoromethyl-benzyloxy)-phenyl]-meth-(Z)-ylidene]-4-oxo-2-thioxo-thiazolidin-3-yl}-acetic acid
Type:
Small organic molecule
Emp. Form.:
C27H20F3NO5S2
Mol. Mass.:
559.577
SMILES:
OC(=O)CN1C(=S)S\C(=C/c2ccc(OCc3ccccc3)c(OCc3cccc(c3)C(F)(F)F)c2)C1=O
: