Target
Beta-lactamase
Ligand
BDBM50149786
Substrate
Meas. Tech.
ChEMBL_302784 (CHEMBL839469)
Ki
300±n/a nM
Citation
 Buzzoni, VBlazquez, JFerrari, SCalò, SVenturelli, ACosti, MP Aza-boronic acids as non-beta-lactam inhibitors of AmpC-beta-lactamase. Bioorg Med Chem Lett 14:3979-83 (2004)  
Target
Name:
Beta-lactamase
Synonyms:
AMPC_ECOLI Beta-lactamase (AmpC) Cephalosporinase ampA | ampC
Type:
Protien
Mol. Mass.:
41561.62
Organism:
Escherichia coli
Description:
P00811
Residue:
377
  
Inhibitor
Name:
BDBM50149786
Synonyms:
Aza-boronic acid derivative | CHEMBL184695
Type:
Small organic molecule
Emp. Form.:
C16H13BN2O3
Mol. Mass.:
292.097
SMILES:
OB(O)c1cccc(c1)N=Nc1c(O)ccc2ccccc12
: