Target
Lysophosphatidic acid receptor 1
Ligand
BDBM50146232
Substrate
Meas. Tech.
ChEMBL_302402 (CHEMBL829647)
Ki
18±n/a nM
Citation
 Heasley, BHJarosz, RCarter, KMVan, SJLynch, KRMacdonald, TL A novel series of 2-pyridyl-containing compounds as lysophosphatidic acid receptor antagonists: development of a nonhydrolyzable LPA3 receptor-selective antagonist. Bioorg Med Chem Lett 14:4069-74 (2004)  
Target
Name:
Lysophosphatidic acid receptor 1
Synonyms:
EDG2 LPA-1 LPAR1 Lysophosphatidic acid receptor 1 (LPA1) | Lysophosphatidic acid receptor Edg-2
Type:
Enzyme
Mol. Mass.:
41120.55
Organism:
Homo sapiens (Human)
Description:
Q92633
Residue:
364
  
Inhibitor
Name:
BDBM50146232
Synonyms:
CHEMBL440696 | Phosphoric acid mono-{(R)-2-((Z)-octadec-9-enoylamino)-3-[4-(pyridin-2-ylmethoxy)-phenyl]-propyl} ester
Type:
Small organic molecule
Emp. Form.:
C33H51N2O6P
Mol. Mass.:
602.7416
SMILES:
CCCCCCCC\C=C/CCCCCCCC(=O)N[C@@H](COP(O)(O)=O)Cc1ccc(OCc2ccccn2)cc1
: